{"text_format":"1","workbook":"xlsx","n_sheets":6,"sheets":["Team Sheets","Match Score Sheet","Calculations","Player Scoring Sheet","Notes","Codes"],"not_rendered":{"charts":0,"images":2,"macros":1,"external_links":0,"defined_names":2,"comments":0,"pivot_tables":0},"unopened":[],"bounds":{"document_bytes":16777216,"sheet_cells":100000,"rows_first":2000,"rows_last":500,"rows_between":2000,"halvings":0,"cell_chars":16384,"cell_head_chars":4096},"cells_cut":0,"cells_raw":0,"read":"whole","date_system":"1900"}

{"sheet":"Team Sheets","index":0,"n_rows":30,"n_cols":6,"rows_kept":30,"cut":false,"hidden":false,"merged":[[0,1,0,5]]}
[null,"Run-on Team List"]
[null,"Home Team:",{"$f":"'Match Score Sheet'!B15","v":0},null,"Away Team",{"$f":"'Match Score Sheet'!B16","v":0}]
[null,1,null,null,1]
[null,2,null,null,2]
[null,3,null,null,3]
[null,4,null,null,4]
[null,5,null,null,5]
[null,6,null,null,6]
{"$rows_left_out":23}
{"sheet":"Match Score Sheet","index":1,"n_rows":100,"n_cols":14,"rows_kept":100,"cut":false,"hidden":false,"merged":[[59,4,59,5],[54,4,54,5],[55,4,55,5],[56,4,56,5],[57,4,57,5],[58,4,58,5],[49,4,49,5],[50,4,50,5],[51,4,51,5],[52,4,52,5],[53,4,53,5],[45,4,45,5],[46,4,46,5],[47,4,47,5],[48,4,48,5],[39,4,39,5],[40,4,40,5],[41,4,41,5],[42,4,42,5],[43,4,43,5],[36,4,36,5],[37,4,37,5],[38,4,38,5],[29,4,29,5],[30,4,30,5],[31,4,31,5],[32,4,32,5],[33,4,33,5],[44,4,44,5],[1,7,1,8],[0,0,0,10],[6,0,7,5],[2,7,2,8],[3,7,3,8],[4,7,4,8],[5,7,5,8],[6,7,6,8],[7,7,7,8],[2,1,5,5],[18,4,18,5],[14,1,14,3],[15,1,15,3],[9,1,9,4],[10,1,10,4],[11,1,11,4],[8,7,8,8],[9,7,9,8],[60,4,60,5],[11,7,11,8],[19,4,19,5],[20,4,20,5],[21,4,21,5],[22,4,22,5],[23,4,23,5],[17,0,17,7],[24,4,24,5],[25,4,25,5],[26,4,26,5],[27,4,27,5],[28,4,28,5],[10,7,10,8],[34,4,34,5],[35,4,35,5],[61,4,61,5],[62,4,62,5],[63,4,63,5],[64,4,64,5],[65,4,65,5],[66,4,66,5],[67,4,67,5],[68,4,68,5],[85,4,85,5],[84,4,84,5],[83,4,83,5],[82,4,82,5],[81,4,81,5],[72,4,72,5],[71,4,71,5],[69,4,69,5],[70,4,70,5],[80,4,80,5],[79,4,79,5],[78,4,78,5],[73,4,73,5],[74,4,74,5],[75,4,75,5],[76,4,76,5],[77,4,77,5],[99,4,99,5],[89,4,89,5],[90,4,90,5],[91,4,91,5],[92,4,92,5],[93,4,93,5],[94,4,94,5],[95,4,95,5],[96,4,96,5],[97,4,97,5],[98,4,98,5],[88,4,88,5],[86,4,86,5],[87,4,87,5]]}
["SOUTH AFRICAN RUGBY UNION MATCH SCORE SHEET ver 2025.03"]
[null,null,null,null,null,null,null,"Match Officials Names:"]
["e-mail to:","EddieG@sarugby.co.za; mornen@sarugby.co.za; jaco@evolveav.co.za; Tumi.Leseke@sarugby.co.za; matchcoding@mobii.com; eugenev@sarugby.co.za",null,null,null,null,"Referee :"]
[null,null,null,null,null,null,"TMO:"]
[null,null,null,null,null,null,"AR 1:"]
[null,null,null,null,null,null,"AR 2 :"]
["WhatsApp Halftime score, and immediately after the final whistle this RED BOX to 0824489635, 0826935917, 0763000706, 0677225752",null,null,null,null,null,"RC 4:"]
[null,null,null,null,null,null,"RC 5:"]
{"$rows_left_out":93}
{"sheet":"Calculations","index":2,"n_rows":86,"n_cols":40,"rows_kept":86,"cut":false,"hidden":true,"merged":[[85,35,85,36],[85,15,85,16],[0,1,0,5],[0,22,0,24],[0,25,0,29]]}
["Home Team:",{"$f":"'Match Score Sheet'!B15","v":0},null,null,null,null,null,null,null,null,null,null,null,null,null,null,null,null,null,null,null,null,"Away Team:",null,null,{"$f":"'Match Score Sheet'!B16","v":0}]
[]
[null,"Try","Penalty Try","Conversion","Penalty","Drop Goal","try","PT","con","Pen","Drop",null,"Points",null,null,null,"Halftime Score",null,null,"Full Time Score",null,null,null,"Try","Penalty Try","Conversion","Penalty","Drop Goal","Try","PT","Con","Pen","Drop",null,"Points",null,"Halftime Score",null,"Full Time Score"]
[null,{"$f":"AND('Match Score Sheet'!B20 = \"h\",'Match Score Sheet'!C20 = \"t\")","v":false},{"$f":"AND('Match Score Sheet'!B20 = \"h\",'Match Score Sheet'!C20 = \"pt\")","v":false},{"$f":"AND('Match Score Sheet'!B20 = \"h\",'Match Score Sheet'!C20 = \"c\")","v":false},{"$f":"AND('Match Score Sheet'!B20 = \"h\",'Match Score Sheet'!C20 = \"p\")","v":false},{"$f":"AND('Match Score Sheet'!B20 = \"h\",'Match Score Sheet'!C20 = \"dg\")","v":false},{"$f":"IF(B4 = TRUE,5,0)","v":0},{"$f":"IF(C4 = TRUE,7,0)","v":0},{"$f":"IF(D4 = TRUE,2,0)","v":0},{"$f":"IF(E4 = TRUE,3,0)","v":0},{"$f":"IF(F4 = TRUE,3,0)","v":0},{"$f":"SUM(G4:K4)","v":0},{"$f":"L4","v":0},null,null,null,{"$f":"AND('Match Score Sheet'!B20 = \"\",'Match Score Sheet'!C20 = \"fh-e\")","v":false},{"$f":"IF(Q4=TRUE,M4,\"\")","v":""},null,{"$f":"AND('Match Score Sheet'!B20 = \"\",'Match Score Sheet'!C20 = \"sh-e\")","v":false},{"$f":"IF(T4=TRUE,M4,\"\")","v":""},null,null,{"$f":"AND('Match Score Sheet'!B20 = \"a\",'Match Score Sheet'!C20 = \"t\")","v":false},{"$f":"AND('Match Score Sheet'!B20 = \"a\",'Match Score Sheet'!C20 = \"pt\")","v":false},{"$f":"AND('Match Score Sheet'!B20 = \"a\",'Match Score Sheet'!C20 = \"c\")","v":false},{"$f":"AND('Match Score Sheet'!B20 = \"a\",'Match Score Sheet'!C20 = \"p\")","v":false},{"$f":"AND('Match Score Sheet'!B20 = \"a\",'Match Score Sheet'!C20 = \"dg\")","v":false},{"$f":"IF(X4 = TRUE,5,0)","v":0},{"$f":"IF(Y4 = TRUE,7,0)","v":0},{"$f":"IF(Z4 = TRUE,2,0)","v":0},{"$f":"IF(AA4 = TRUE,3,0)","v":0},{"$f":"IF(AB4 = TRUE,3,0)","v":0},{"$f":"SUM(AC4:AG4)","v":0},{"$f":"AH4","v":0},null,{"$f":"AND('Match Score Sheet'!B20 = \"\",'Match Score Sheet'!C20 = \"fh-e\")","v":false},{"$f":"IF(AK4=TRUE,AI4,\"\")","v":""},{"$f":"AND('Match Score Sheet'!B20 = \"\",'Match Score Sheet'!C20 = \"sh-e\")","v":false},{"$f":"IF(AM4=TRUE,AI4,\"\")","v":""}]
[null,{"$f":"AND('Match Score Sheet'!B21 = \"h\",'Match Score Sheet'!C21 = \"t\")","v":false},{"$f":"AND('Match Score Sheet'!B21 = \"h\",'Match Score Sheet'!C21 = \"pt\")","v":false},{"$f":"AND('Match Score Sheet'!B21 = \"h\",'Match Score Sheet'!C21 = \"c\")","v":false},{"$f":"AND('Match Score Sheet'!B21 = \"h\",'Match Score Sheet'!C21 = \"p\")","v":false},{"$f":"AND('Match Score Sheet'!B21 = \"h\",'Match Score Sheet'!C21 = \"dg\")","v":false},{"$f":"IF(B5 = TRUE,5,0)","v":0},{"$f":"IF(C5 = TRUE,7,0)","v":0},{"$f":"IF(D5 = TRUE,2,0)","v":0},{"$f":"IF(E5 = TRUE,3,0)","v":0},{"$f":"IF(F5 = TRUE,3,0)","v":0},{"$f":"SUM(G5:K5)","v":0},{"$f":"M4+L5","v":0},null,null,null,{"$f":"AND('Match Score Sheet'!B21 = \"\",'Match Score Sheet'!C21 = \"fh-e\")","v":false},"",null,{"$f":"AND('Match Score Sheet'!B21 = \"\",'Match Score Sheet'!C21 = \"sh-e\")","v":false},{"$f":"IF(T5=TRUE,M5,\"\")","v":""},null,null,{"$f":"AND('Match Score Sheet'!B21 = \"a\",'Match Score Sheet'!C21 = \"t\")","v":false},{"$f":"AND('Match Score Sheet'!B21 = \"a\",'Match Score Sheet'!C21 = \"pt\")","v":false},{"$f":"AND('Match Score Sheet'!B21 = \"a\",'Match Score Sheet'!C21 = \"c\")","v":false},{"$f":"AND('Match Score Sheet'!B21 = \"a\",'Match Score Sheet'!C21 = \"p\")","v":false},{"$f":"AND('Match Score Sheet'!B21 = \"a\",'Match Score Sheet'!C21 = \"dg\")","v":false},{"$f":"IF(X5 = TRUE,5,0)","v":0},{"$f":"IF(Y5 = TRUE,7,0)","v":0},{"$f":"IF(Z5 = TRUE,2,0)","v":0},{"$f":"IF(AA5 = TRUE,3,0)","v":0},{"$f":"IF(AB5 = TRUE,3,0)","v":0},{"$f":"SUM(AC5:AG5)","v":0},{"$f":"AI4+AH5","v":0},null,{"$f":"AND('Match Score Sheet'!B21 = \"\",'Match Score Sheet'!C21 = \"fh-e\")","v":false},"",{"$f":"AND('Match Score Sheet'!B21 = \"\",'Match Score Sheet'!C21 = \"sh-e\")","v":false},{"$f":"IF(AM5=TRUE,AI5,\"\")","v":""}]
[null,{"$f":"AND('Match Score Sheet'!B22 = \"h\",'Match Score Sheet'!C22 = \"t\")","v":false},{"$f":"AND('Match Score Sheet'!B22 = \"h\",'Match Score Sheet'!C22 = \"pt\")","v":false},{"$f":"AND('Match Score Sheet'!B22 = \"h\",'Match Score Sheet'!C22 = \"c\")","v":false},{"$f":"AND('Match Score Sheet'!B22 = \"h\",'Match Score Sheet'!C22 = \"p\")","v":false},{"$f":"AND('Match Score Sheet'!B22 = \"h\",'Match Score Sheet'!C22 = \"dg\")","v":false},0,0,0,0,0,0,{"$f":"M5+L6","v":0},null,null,null,{"$f":"AND('Match Score Sheet'!B22 = \"\",'Match Score Sheet'!C22 = \"fh-e\")","v":false},"",null,{"$f":"AND('Match Score Sheet'!B22 = \"\",'Match Score Sheet'!C22 = \"sh-e\")","v":false},"",null,null,{"$f":"AND('Match Score Sheet'!B22 = \"a\",'Match Score Sheet'!C22 = \"t\")","v":false},{"$f":"AND('Match Score Sheet'!B22 = \"a\",'Match Score Sheet'!C22 = \"pt\")","v":false},{"$f":"AND('Match Score Sheet'!B22 = \"a\",'Match Score Sheet'!C22 = \"c\")","v":false},{"$f":"AND('Match Score Sheet'!B22 = \"a\",'Match Score Sheet'!C22 = \"p\")","v":false},{"$f":"AND('Match Score Sheet'!B22 = \"a\",'Match Score Sheet'!C22 = \"dg\")","v":false},0,0,0,0,0,0,{"$f":"AI5+AH6","v":0},null,{"$f":"AND('Match Score Sheet'!B22 = \"\",'Match Score Sheet'!C22 = \"fh-e\")","v":false},"",{"$f":"AND('Match Score Sheet'!B22 = \"\",'Match Score Sheet'!C22 = \"sh-e\")","v":false},""]
[null,{"$f":"AND('Match Score Sheet'!B23 = \"h\",'Match Score Sheet'!C23 = \"t\")","v":false},{"$f":"AND('Match Score Sheet'!B23 = \"h\",'Match Score Sheet'!C23 = \"pt\")","v":false},{"$f":"AND('Match Score Sheet'!B23 = \"h\",'Match Score Sheet'!C23 = \"c\")","v":false},{"$f":"AND('Match Score Sheet'!B23 = \"h\",'Match Score Sheet'!C23 = \"p\")","v":false},{"$f":"AND('Match Score Sheet'!B23 = \"h\",'Match Score Sheet'!C23 = \"dg\")","v":false},0,0,0,0,0,0,{"$f":"M6+L7","v":0},null,null,null,{"$f":"AND('Match Score Sheet'!B23 = \"\",'Match Score Sheet'!C23 = \"fh-e\")","v":false},"",null,{"$f":"AND('Match Score Sheet'!B23 = \"\",'Match Score Sheet'!C23 = \"sh-e\")","v":false},"",null,null,{"$f":"AND('Match Score Sheet'!B23 = \"a\",'Match Score Sheet'!C23 = \"t\")","v":false},{"$f":"AND('Match Score Sheet'!B23 = \"a\",'Match Score Sheet'!C23 = \"pt\")","v":false},{"$f":"AND('Match Score Sheet'!B23 = \"a\",'Match Score Sheet'!C23 = \"c\")","v":false},{"$f":"AND('Match Score Sheet'!B23 = \"a\",'Match Score Sheet'!C23 = \"p\")","v":false},{"$f":"AND('Match Score Sheet'!B23 = \"a\",'Match Score Sheet'!C23 = \"dg\")","v":false},0,0,0,0,0,0,0,null,{"$f":"AND('Match Score Sheet'!B23 = \"\",'Match Score Sheet'!C23 = \"fh-e\")","v":false},"",{"$f":"AND('Match Score Sheet'!B23 = \"\",'Match Score Sheet'!C23 = \"sh-e\")","v":false},""]
[null,{"$f":"AND('Match Score Sheet'!B24 = \"h\",'Match Score Sheet'!C24 = \"t\")","v":false},{"$f":"AND('Match Score Sheet'!B24 = \"h\",'Match Score Sheet'!C24 = \"pt\")","v":false},{"$f":"AND('Match Score Sheet'!B24 = \"h\",'Match Score Sheet'!C24 = \"c\")","v":false},{"$f":"AND('Match Score Sheet'!B24 = \"h\",'Match Score Sheet'!C24 = \"p\")","v":false},{"$f":"AND('Match Score Sheet'!B24 = \"h\",'Match Score Sheet'!C24 = \"dg\")","v":false},0,0,0,0,0,0,0,null,null,null,{"$f":"AND('Match Score Sheet'!B24 = \"\",'Match Score Sheet'!C24 = \"fh-e\")","v":false},"",null,{"$f":"AND('Match Score Sheet'!B24 = \"\",'Match Score Sheet'!C24 = \"sh-e\")","v":false},"",null,null,{"$f":"AND('Match Score Sheet'!B24 = \"a\",'Match Score Sheet'!C24 = \"t\")","v":false},{"$f":"AND('Match Score Sheet'!B24 = \"a\",'Match Score Sheet'!C24 = \"pt\")","v":false},{"$f":"AND('Match Score Sheet'!B24 = \"a\",'Match Score Sheet'!C24 = \"c\")","v":false},{"$f":"AND('Match Score Sheet'!B24 = \"a\",'Match Score Sheet'!C24 = \"p\")","v":false},{"$f":"AND('Match Score Sheet'!B24 = \"a\",'Match Score Sheet'!C24 = \"dg\")","v":false},0,0,0,0,0,0,0,null,{"$f":"AND('Match Score Sheet'!B24 = \"\",'Match Score Sheet'!C24 = \"fh-e\")","v":false},"",{"$f":"AND('Match Score Sheet'!B24 = \"\",'Match Score Sheet'!C24 = \"sh-e\")","v":false},""]
{"$rows_left_out":79}
{"sheet":"Player Scoring Sheet","index":3,"n_rows":31,"n_cols":16,"rows_kept":31,"cut":false,"hidden":false,"merged":[[0,3,0,7],[0,11,0,15]]}
[null,null,"Home Team Final Score",{"$f":"(D31*5)+(E31*2)+(F31*3)+(G31*3)+(H31*7)","v":0},null,null,null,null,null,null,"Away Team Final Score",{"$f":"(L31*5)+(M31*2)+(N31*3)+(O31*3)+(P31*7)","v":0}]
[null,null,{"$f":"'Team Sheets'!C2","v":0},"T","C","P","DG","PT",null,null,{"$f":"'Team Sheets'!F2","v":0},"T","C","P","DG","PT"]
[null,{"$f":"'Team Sheets'!B3","v":1},{"$f":"IF('Team Sheets'!C3=\"\",\"\",'Team Sheets'!C3)","v":""},{"$f":"COUNTIFS('Match Score Sheet'!$B$20:$B$100,\"H\",'Match Score Sheet'!$C$20:$C$100,$D$2,'Match Score Sheet'!$D$20:$D$100,B3)","v":0},{"$f":"COUNTIFS('Match Score Sheet'!$B$20:$B$100,\"H\",'Match Score Sheet'!$C$20:$C$100,$E$2,'Match Score Sheet'!$D$20:$D$100,B3)","v":0},{"$f":"COUNTIFS('Match Score Sheet'!$B$20:$B$100,\"H\",'Match Score Sheet'!$C$20:$C$100,$F$2,'Match Score Sheet'!$D$20:$D$100,B3)","v":0},{"$f":"COUNTIFS('Match Score Sheet'!$B$20:$B$100,\"H\",'Match Score Sheet'!$C$20:$C$100,$G$2,'Match Score Sheet'!$D$20:$D$100,B3)","v":0},{"$f":"COUNTIFS('Match Score Sheet'!$B$20:$B$100,\"H\",'Match Score Sheet'!$C$20:$C$100,$H$2)","v":0},null,{"$f":"'Team Sheets'!E3","v":1},{"$f":"IF('Team Sheets'!F3=\"\",\"\",'Team Sheets'!F3)","v":""},{"$f":"COUNTIFS('Match Score Sheet'!$B$20:$B$100,\"A\",'Match Score Sheet'!$C$20:$C$100,$L$2,'Match Score Sheet'!$D$20:$D$100,J3)","v":0},{"$f":"COUNTIFS('Match Score Sheet'!$B$20:$B$100,\"a\",'Match Score Sheet'!$C$20:$C$100,$M$2,'Match Score Sheet'!$D$20:$D$100,J3)","v":0},{"$f":"COUNTIFS('Match Score Sheet'!$B$20:$B$100,\"a\",'Match Score Sheet'!$C$20:$C$100,$N$2,'Match Score Sheet'!$D$20:$D$100,J3)","v":0},{"$f":"COUNTIFS('Match Score Sheet'!$B$20:$B$100,\"a\",'Match Score Sheet'!$C$20:$C$100,$O$2,'Match Score Sheet'!$D$20:$D$100,J3)","v":0},{"$f":"COUNTIFS('Match Score Sheet'!$B$20:$B$100,\"a\",'Match Score Sheet'!$C$20:$C$100,$P$2)","v":0}]
[null,{"$f":"'Team Sheets'!B4","v":2},{"$f":"IF('Team Sheets'!C4=\"\",\"\",'Team Sheets'!C4)","v":""},{"$f":"COUNTIFS('Match Score Sheet'!$B$20:$B$100,\"H\",'Match Score Sheet'!$C$20:$C$100,$D$2,'Match Score Sheet'!$D$20:$D$100,B4)","v":0},{"$f":"COUNTIFS('Match Score Sheet'!$B$20:$B$100,\"H\",'Match Score Sheet'!$C$20:$C$100,$E$2,'Match Score Sheet'!$D$20:$D$100,B4)","v":0},{"$f":"COUNTIFS('Match Score Sheet'!$B$20:$B$100,\"H\",'Match Score Sheet'!$C$20:$C$100,$F$2,'Match Score Sheet'!$D$20:$D$100,B4)","v":0},{"$f":"COUNTIFS('Match Score Sheet'!$B$20:$B$100,\"H\",'Match Score Sheet'!$C$20:$C$100,$G$2,'Match Score Sheet'!$D$20:$D$100,B4)","v":0},null,null,{"$f":"'Team Sheets'!E4","v":2},{"$f":"IF('Team Sheets'!F4=\"\",\"\",'Team Sheets'!F4)","v":""},{"$f":"COUNTIFS('Match Score Sheet'!$B$20:$B$100,\"A\",'Match Score Sheet'!$C$20:$C$100,$L$2,'Match Score Sheet'!$D$20:$D$100,J4)","v":0},{"$f":"COUNTIFS('Match Score Sheet'!$B$20:$B$100,\"a\",'Match Score Sheet'!$C$20:$C$100,$M$2,'Match Score Sheet'!$D$20:$D$100,J4)","v":0},{"$f":"COUNTIFS('Match Score Sheet'!$B$20:$B$100,\"a\",'Match Score Sheet'!$C$20:$C$100,$N$2,'Match Score Sheet'!$D$20:$D$100,J4)","v":0},{"$f":"COUNTIFS('Match Score Sheet'!$B$20:$B$100,\"a\",'Match Score Sheet'!$C$20:$C$100,$O$2,'Match Score Sheet'!$D$20:$D$100,J4)","v":0}]
[null,{"$f":"'Team Sheets'!B5","v":3},{"$f":"IF('Team Sheets'!C5=\"\",\"\",'Team Sheets'!C5)","v":""},{"$f":"COUNTIFS('Match Score Sheet'!$B$20:$B$100,\"H\",'Match Score Sheet'!$C$20:$C$100,$D$2,'Match Score Sheet'!$D$20:$D$100,B5)","v":0},{"$f":"COUNTIFS('Match Score Sheet'!$B$20:$B$100,\"H\",'Match Score Sheet'!$C$20:$C$100,$E$2,'Match Score Sheet'!$D$20:$D$100,B5)","v":0},{"$f":"COUNTIFS('Match Score Sheet'!$B$20:$B$100,\"H\",'Match Score Sheet'!$C$20:$C$100,$F$2,'Match Score Sheet'!$D$20:$D$100,B5)","v":0},{"$f":"COUNTIFS('Match Score Sheet'!$B$20:$B$100,\"H\",'Match Score Sheet'!$C$20:$C$100,$G$2,'Match Score Sheet'!$D$20:$D$100,B5)","v":0},null,null,{"$f":"'Team Sheets'!E5","v":3},{"$f":"IF('Team Sheets'!F5=\"\",\"\",'Team Sheets'!F5)","v":""},{"$f":"COUNTIFS('Match Score Sheet'!$B$20:$B$100,\"A\",'Match Score Sheet'!$C$20:$C$100,$L$2,'Match Score Sheet'!$D$20:$D$100,J5)","v":0},{"$f":"COUNTIFS('Match Score Sheet'!$B$20:$B$100,\"a\",'Match Score Sheet'!$C$20:$C$100,$M$2,'Match Score Sheet'!$D$20:$D$100,J5)","v":0},{"$f":"COUNTIFS('Match Score Sheet'!$B$20:$B$100,\"a\",'Match Score Sheet'!$C$20:$C$100,$N$2,'Match Score Sheet'!$D$20:$D$100,J5)","v":0},{"$f":"COUNTIFS('Match Score Sheet'!$B$20:$B$100,\"a\",'Match Score Sheet'!$C$20:$C$100,$O$2,'Match Score Sheet'!$D$20:$D$100,J5)","v":0}]
[null,{"$f":"'Team Sheets'!B6","v":4},{"$f":"IF('Team Sheets'!C6=\"\",\"\",'Team Sheets'!C6)","v":""},{"$f":"COUNTIFS('Match Score Sheet'!$B$20:$B$100,\"H\",'Match Score Sheet'!$C$20:$C$100,$D$2,'Match Score Sheet'!$D$20:$D$100,B6)","v":0},{"$f":"COUNTIFS('Match Score Sheet'!$B$20:$B$100,\"H\",'Match Score Sheet'!$C$20:$C$100,$E$2,'Match Score Sheet'!$D$20:$D$100,B6)","v":0},{"$f":"COUNTIFS('Match Score Sheet'!$B$20:$B$100,\"H\",'Match Score Sheet'!$C$20:$C$100,$F$2,'Match Score Sheet'!$D$20:$D$100,B6)","v":0},{"$f":"COUNTIFS('Match Score Sheet'!$B$20:$B$100,\"H\",'Match Score Sheet'!$C$20:$C$100,$G$2,'Match Score Sheet'!$D$20:$D$100,B6)","v":0},null,null,{"$f":"'Team Sheets'!E6","v":4},{"$f":"IF('Team Sheets'!F6=\"\",\"\",'Team Sheets'!F6)","v":""},{"$f":"COUNTIFS('Match Score Sheet'!$B$20:$B$100,\"A\",'Match Score Sheet'!$C$20:$C$100,$L$2,'Match Score Sheet'!$D$20:$D$100,J6)","v":0},{"$f":"COUNTIFS('Match Score Sheet'!$B$20:$B$100,\"a\",'Match Score Sheet'!$C$20:$C$100,$M$2,'Match Score Sheet'!$D$20:$D$100,J6)","v":0},{"$f":"COUNTIFS('Match Score Sheet'!$B$20:$B$100,\"a\",'Match Score Sheet'!$C$20:$C$100,$N$2,'Match Score Sheet'!$D$20:$D$100,J6)","v":0},{"$f":"COUNTIFS('Match Score Sheet'!$B$20:$B$100,\"a\",'Match Score Sheet'!$C$20:$C$100,$O$2,'Match Score Sheet'!$D$20:$D$100,J6)","v":0}]
[null,{"$f":"'Team Sheets'!B7","v":5},{"$f":"IF('Team Sheets'!C7=\"\",\"\",'Team Sheets'!C7)","v":""},{"$f":"COUNTIFS('Match Score Sheet'!$B$20:$B$100,\"H\",'Match Score Sheet'!$C$20:$C$100,$D$2,'Match Score Sheet'!$D$20:$D$100,B7)","v":0},{"$f":"COUNTIFS('Match Score Sheet'!$B$20:$B$100,\"H\",'Match Score Sheet'!$C$20:$C$100,$E$2,'Match Score Sheet'!$D$20:$D$100,B7)","v":0},{"$f":"COUNTIFS('Match Score Sheet'!$B$20:$B$100,\"H\",'Match Score Sheet'!$C$20:$C$100,$F$2,'Match Score Sheet'!$D$20:$D$100,B7)","v":0},{"$f":"COUNTIFS('Match Score Sheet'!$B$20:$B$100,\"H\",'Match Score Sheet'!$C$20:$C$100,$G$2,'Match Score Sheet'!$D$20:$D$100,B7)","v":0},null,null,{"$f":"'Team Sheets'!E7","v":5},{"$f":"IF('Team Sheets'!F7=\"\",\"\",'Team Sheets'!F7)","v":""},{"$f":"COUNTIFS('Match Score Sheet'!$B$20:$B$100,\"A\",'Match Score Sheet'!$C$20:$C$100,$L$2,'Match Score Sheet'!$D$20:$D$100,J7)","v":0},{"$f":"COUNTIFS('Match Score Sheet'!$B$20:$B$100,\"a\",'Match Score Sheet'!$C$20:$C$100,$M$2,'Match Score Sheet'!$D$20:$D$100,J7)","v":0},{"$f":"COUNTIFS('Match Score Sheet'!$B$20:$B$100,\"a\",'Match Score Sheet'!$C$20:$C$100,$N$2,'Match Score Sheet'!$D$20:$D$100,J7)","v":0},{"$f":"COUNTIFS('Match Score Sheet'!$B$20:$B$100,\"a\",'Match Score Sheet'!$C$20:$C$100,$O$2,'Match Score Sheet'!$D$20:$D$100,J7)","v":0}]
[null,{"$f":"'Team Sheets'!B8","v":6},{"$f":"IF('Team Sheets'!C8=\"\",\"\",'Team Sheets'!C8)","v":""},{"$f":"COUNTIFS('Match Score Sheet'!$B$20:$B$100,\"H\",'Match Score Sheet'!$C$20:$C$100,$D$2,'Match Score Sheet'!$D$20:$D$100,B8)","v":0},{"$f":"COUNTIFS('Match Score Sheet'!$B$20:$B$100,\"H\",'Match Score Sheet'!$C$20:$C$100,$E$2,'Match Score Sheet'!$D$20:$D$100,B8)","v":0},{"$f":"COUNTIFS('Match Score Sheet'!$B$20:$B$100,\"H\",'Match Score Sheet'!$C$20:$C$100,$F$2,'Match Score Sheet'!$D$20:$D$100,B8)","v":0},{"$f":"COUNTIFS('Match Score Sheet'!$B$20:$B$100,\"H\",'Match Score Sheet'!$C$20:$C$100,$G$2,'Match Score Sheet'!$D$20:$D$100,B8)","v":0},null,null,{"$f":"'Team Sheets'!E8","v":6},{"$f":"IF('Team Sheets'!F8=\"\",\"\",'Team Sheets'!F8)","v":""},{"$f":"COUNTIFS('Match Score Sheet'!$B$20:$B$100,\"A\",'Match Score Sheet'!$C$20:$C$100,$L$2,'Match Score Sheet'!$D$20:$D$100,J8)","v":0},{"$f":"COUNTIFS('Match Score Sheet'!$B$20:$B$100,\"a\",'Match Score Sheet'!$C$20:$C$100,$M$2,'Match Score Sheet'!$D$20:$D$100,J8)","v":0},{"$f":"COUNTIFS('Match Score Sheet'!$B$20:$B$100,\"a\",'Match Score Sheet'!$C$20:$C$100,$N$2,'Match Score Sheet'!$D$20:$D$100,J8)","v":0},{"$f":"COUNTIFS('Match Score Sheet'!$B$20:$B$100,\"a\",'Match Score Sheet'!$C$20:$C$100,$O$2,'Match Score Sheet'!$D$20:$D$100,J8)","v":0}]
{"$rows_left_out":24}
{"sheet":"Notes","index":4,"n_rows":21,"n_cols":3,"rows_kept":21,"cut":false,"hidden":false,"merged":[[0,0,0,2],[1,0,1,2],[2,0,2,2],[3,0,10,0],[11,0,20,0]]}
["             Notes on how to fill in Score Sheet"]
["EVENT NOTES"]
["Please keep track of the following events"]
["Scoring","T","Try"]
[null,"PT","Penalty Try - No conversion required"]
[null,"C","Conversion"]
[null,"MC","Missed Conversion"]
[null,"P","Penalty"]
{"$rows_left_out":14}
{"sheet":"Codes","index":5,"n_rows":17,"n_cols":3,"rows_kept":17,"cut":false,"hidden":true,"merged":[]}
["T","H","Currie Cup Premier Division"]
["PT","A","Currie Cup 1st Division"]
["C",null,"SA Cup"]
["MC",null,"U19 SA Rugby Championship"]
["P",null,"U20 SA Rugby Championship"]
["MP",null,"U21 SA Rugby Championship"]
["DG",null,"Women SA Rugby Premier Division"]
["MDG",null,"Women SA Rugby First Division"]
{"$rows_left_out":9}